[Pool] ntp-4.2.8 build failing on Sol-10

Arvind Navale an_linux at live.com
Fri Jan 16 20:13:19 UTC 2015


Hi Folks,
 
I have downloaded the latest ntp-4.2.8 source tar ball on performing build on a Solaris-10 SPARC machine. Here are the options are passed while running configure.
configure --enable-ignore-dns-errors --enable-parse-clocks --without-rpath --without-ntpsnmpd --without-crypto --prefix=/dist
 
I am using sun studio compiler to compile the source code and make command throws these errors and eventually make install doesn't give me anything.
 
"ntp_crypto_rnd.c", line 93: warning: implicit function declaration: arc4random_buf
  CC     ntp_intres.o
  CC     ntp_libopts.o
"../sntp/libopts/autoopts/options.h", line 68: invalid type combination
"../sntp/libopts/autoopts/options.h", line 68: warning: typedef declares no type name
cc: acomp failed for ntp_libopts.c
gmake[2]: *** [ntp_libopts.o] Error 2
gmake[2]: Leaving directory `/tools/SunOS_sparc/ntp/4.2.8-1/build/ntp-4.2.8/libntp'
gmake[1]: *** [../libntp/libntp.a] Error 2
gmake[1]: Leaving directory `/tools/SunOS_sparc/ntp/4.2.8-1/build/ntp-4.2.8/sntp'
gmake: *** [sntp/built-sources-only] Error 2

 
thanks
Arvind
 
 		 	   		  


More information about the pool mailing list