[ntp:questions] Building ntp-4.2.0 on Mac OS X

Gerriet M. Denkmann gerriet at mdenkmann.de
Mon Mar 20 09:58:10 UTC 2006

I downloaded ntp-4.2.0, did ./configure and make and did get:

In file included from systime.c:11:
../include/ntp_stdlib.h:138: error: array type has incomplete element  
make[2]: *** [systime.o] Error 1
make[1]: *** [all-recursive] Error 1
make: *** [all] Error 2

Is there a (maybe more recent, maybe not completely stable) version,  
which does build on Mac OS X 10.4.5?
Or do I made some mistakes building 4.2.0?

Any hints would be most welcome.


More information about the questions mailing list